BDBM29213 casimiroin analogue, 1b
SMILES Cc1cc(=O)n(C)c2c3OCOc3ccc12
InChI Key InChIKey=FEMZVADPTYXZIF-UHFFFAOYSA-N
Data  2 IC50
PDB links: 1 PDB ID matches this monomer.
  Tab Delimited (TSV)   2D SDfile   Computed 3D by Vconf -m prep SDfile
Find this compound or compounds like it in BindingDB:
Activity Spreadsheet -- Enzyme Inhibition Constant Data from BindingDB
Found 2 hits for monomerid = 29213
TargetAromatase(Homo sapiens (Human))
Purdue University
LigandPNGBDBM29213(casimiroin analogue, 1b)
Affinity DataIC50:  1.25E+3nM. Assay description: Aromatase inhibition was quantified by measuring the fluorescent intensity of fluorescein, the hydrolysis product of dibenzylfluorescein (DBF), by ar...
In DepthDetails ArticlePubMed
TargetRibosyldihydronicotinamide dehydrogenase [quinone](Homo sapiens (Human))
Purdue University
LigandPNGBDBM29213(casimiroin analogue, 1b)
Affinity DataIC50:  6.20E+3nMpH: 7.5 T: 2°C. Assay description: The activity of QR2 under steady-state conditions was evaluated on SpectraMax Plus 384 UV/vis spectrophotometer by monitoring the increase in absorba...