BDBM29217 casimiroin analogue, 1f
SMILES COc1cccc2c(C)cc(=O)n(C)c12
InChI Key InChIKey=NCNFIHNRVBJRPR-UHFFFAOYSA-N
Data  2 IC50
  Tab Delimited (TSV)   2D SDfile   Computed 3D by Vconf -m prep SDfile
Find this compound or compounds like it in BindingDB:
Activity Spreadsheet -- Enzyme Inhibition Constant Data from BindingDB
Found 2 hits for monomerid = 29217
TargetAromatase(Homo sapiens (Human))
Purdue University
LigandPNGBDBM29217(casimiroin analogue, 1f)
Affinity DataIC50:  2.02E+3nM. Assay description: Aromatase inhibition was quantified by measuring the fluorescent intensity of fluorescein, the hydrolysis product of dibenzylfluorescein (DBF), by ar...
In DepthDetails ArticlePubMed
TargetRibosyldihydronicotinamide dehydrogenase [quinone](Homo sapiens (Human))
Purdue University
LigandPNGBDBM29217(casimiroin analogue, 1f)
Affinity DataIC50:  5.80E+3nMpH: 7.5 T: 2°C. Assay description: The activity of QR2 under steady-state conditions was evaluated on SpectraMax Plus 384 UV/vis spectrophotometer by monitoring the increase in absorba...
In DepthDetails ArticlePubMed