BDBM301743 ((S)-6-{(R)-7-Fluoro-4-[4-(3-hydroxy-3-methylbutyl)-1H-indol-5-yloxy]-indan-1-ylox}-2,3-dihydrobenzofuran-3-yl)-acetic acid::US9597310, 33
SMILES CC(C)(O)CCn1ccc2cc(Oc3ccc(F)c4[C@@H](CCc34)Oc3ccc4[C@H](CC(O)=O)COc4c3)ccc12
InChI Key InChIKey=HALGSUPWGOWPQG-PIIWDFAUSA-N
Data  1 EC50
  Tab Delimited (TSV)   2D SDfile   Computed 3D by Vconf -m prep SDfile
Find this compound or compounds like it in BindingDB:
Activity Spreadsheet -- Enzyme Inhibition Constant Data from BindingDB
Found 1 hit for monomerid = 301743
TargetFree fatty acid receptor 1(Homo sapiens (Human))
Boehringer Ingelheim International
US Patent
LigandPNGBDBM301743(((S)-6-{(R)-7-Fluoro-4-[4-(3-hydroxy-3-methylbutyl...)
Affinity DataEC50:  45nM. Assay description: IP1 accumulation measurements using the IPOne assay system 1321N1 cells stably expressing human GPR40 receptor (Euroscreen, Belgium) are seeded 24 h ...
Ligand InfoPC cidPC sid
In DepthDetails US Patent