BDBM301747 1-{4-[2,6-Difluoro-4-(4,4,5,5-tetramethyl-[1,3,2]dioxaborolan-2-yl)-phenyl]-pyrazol-1-yl}-2-methyl-propan-2-ol::US9597310, 37
SMILES OC(=O)C[C@@H]1COc2cc(O[C@@H]3CCc4c3c(F)ccc4Oc3ccc(OCC4(O)CCOCC4)c(F)c3)ccc12
InChI Key InChIKey=JIEVMZUTKXYSRI-DNOBIOAJSA-N
Data  1 EC50
  Tab Delimited (TSV)   2D SDfile   Computed 3D by Vconf -m prep SDfile
Find this compound or compounds like it in BindingDB:
Activity Spreadsheet -- Enzyme Inhibition Constant Data from BindingDB
Found 1 hit for monomerid = 301747
TargetFree fatty acid receptor 1(Homo sapiens (Human))
Boehringer Ingelheim International
US Patent
LigandPNGBDBM301747(1-{4-[2,6-Difluoro-4-(4,4,5,5-tetramethyl-[1,3,2]d...)
Affinity DataEC50:  8nM. Assay description: IP1 accumulation measurements using the IPOne assay system 1321N1 cells stably expressing human GPR40 receptor (Euroscreen, Belgium) are seeded 24 h ...
Ligand InfoPC cidPC sid
In DepthDetails US Patent