BDBM302409 US9598416, Example 55
SMILES COc1cc(C)cc2cc(sc12)-c1c(CN2CCNC(=O)C2C)cn2ncnc(N)c12
InChI Key InChIKey=PZUMGJXNMDBEIT-UHFFFAOYSA-N
Data  2 IC50
  Tab Delimited (TSV)   2D SDfile   Computed 3D by Vconf -m prep SDfile
Find this compound or compounds like it in BindingDB:
Activity Spreadsheet -- Enzyme Inhibition Constant Data from BindingDB
Found 2 hits for monomerid = 302409
TargetFibroblast growth factor receptor 3(Homo sapiens (Human))
Bayer Intellectual Property
US Patent
LigandPNGBDBM302409(US9598416, Example 55)
Affinity DataIC50:  1.40nM
Ligand InfoPC cidPC sid
In DepthDetails US Patent
TargetFibroblast growth factor receptor 1(Homo sapiens (Human))
Bayer Intellectual Property
US Patent
LigandPNGBDBM302409(US9598416, Example 55)
Affinity DataIC50:  2.70nM. Assay description: Usually, test compounds were tested on the same microtiter plate at 11 different concentrations in the range of 20 μM to 0.1 nM (e.g. 20 μM...
Ligand InfoPC cidPC sid
In DepthDetails US Patent