BDBM304522 (R)-2-(4-(4-fluoro-3-(methylsulfonyl)phenyl)-2-isopropylpiperazin-1-yl)-4-methyl-5-(trifluoromethyl)pyrimidine::US10144715, Compound 37-1
SMILES CC(C)[C@@H]1CN(CCN1c1ncc(c(C)n1)C(F)(F)F)c1ccc(F)c(c1)S(C)(=O)=O
InChI Key InChIKey=DXEPMKDNFAOHFI-KRWDZBQOSA-N
Data  1 KI
  Tab Delimited (TSV)   2D SDfile   Computed 3D by Vconf -m prep SDfile
Find this compound or compounds like it in BindingDB:
Activity Spreadsheet -- Enzyme Inhibition Constant Data from BindingDB
Found 1 hit for monomerid = 304522
TargetOxysterols receptor LXR-beta(Homo sapiens (Human))
Vitae Pharmaceuticals
US Patent
LigandPNGBDBM304522((R)-2-(4-(4-fluoro-3-(methylsulfonyl)phenyl)-2-iso...)
Affinity DataKi:  3nM. Assay description: Compounds of the invention were assessed in a competition binding assay where different concentrations of compounds were incubated with the LXR ligan...
Ligand InfoPC cidPC sid
In DepthDetails US Patent