BDBM31526 Substituted Benzamide Derivative, 33
SMILES C[C@@H](NC(=O)c1cc(ccc1C)C#N)c1cccc2ccccc12
InChI Key InChIKey=GAYCAOYUHXSNTO-OAHLLOKOSA-N
Data  1 IC50
  Tab Delimited (TSV)   2D SDfile   Computed 3D by Vconf -m prep SDfile
Find this compound or compounds like it in BindingDB:
Activity Spreadsheet -- Enzyme Inhibition Constant Data from BindingDB
Found 1 hit for monomerid = 31526
TargetReplicase polyprotein 1ab [1541-1855](Human SARS coronavirus (SARS-CoV))
Purdue University
LigandPNGBDBM31526(Substituted Benzamide Derivative, 33)
Affinity DataIC50:  5.20E+3nMpH: 7.5 T: 2°C. Assay description: IC50 values for all inhibitors were determined using a 96-well plate based assay. Reactions were performed in buffer containing RLRGG-AMC, 2% DMSO, a...
In DepthDetails ArticlePubMed