BDBM31769 Terconazole::cid_5404
SMILES CC(C)N1CCN(CC1)c1ccc(OC[C@@H]2CO[C@](Cn3cncn3)(O2)c2ccc(Cl)cc2Cl)cc1
InChI Key InChIKey=BLSQLHNBWJLIBQ-ZEQKJWHPSA-N
Data  2 IC50  1 EC50
  Tab Delimited (TSV)   2D SDfile   Computed 3D by Vconf -m prep SDfile
Find this compound or compounds like it in BindingDB:
Activity Spreadsheet -- Enzyme Inhibition Constant Data from BindingDB
Found 3 hits for monomerid = 31769
TargetHeme oxygenase 1(Rattus norvegicus (rat))
Queen'S University
LigandPNGBDBM31769(Terconazole | cid_5404)
Affinity DataIC50:  410nMpH: 7.4 T: 2°C. Assay description: HO activity in rat spleen (HO-1) and brain (HO-2) microsomal fractions was determined by the quantitation of CO formed from the degradation of methem...
In DepthDetails ArticlePubMed
TargetXylosyl- and glucuronyltransferase LARGE1(Homo sapiens (Human))
Burnham Center For Chemical Genomics
Curated by PubChem BioAssay
LigandPNGBDBM31769(Terconazole | cid_5404)
Affinity DataEC50:  9.77E+3nM
In DepthDetails PCBioAssay
TargetHeme oxygenase 2(Rattus norvegicus (rat))
Queen'S University
LigandPNGBDBM31769(Terconazole | cid_5404)
Affinity DataIC50:  5.00E+3nMpH: 7.4 T: 2°C. Assay description: HO activity in rat spleen (HO-1) and brain (HO-2) microsomal fractions was determined by the quantitation of CO formed from the degradation of methem...
In DepthDetails ArticlePubMed