BDBM319057 US10173991, Example 100::methyl N-{4-[2- ({[(cyclopropyl- carbamoyl)methyl] carbamoyl}(2- methoxyethane- sulfonyl)methyl)- 1,3-benzothiazol- 6-yl]phenyl} carbamate
SMILES OCCCS(=O)(=O)C(C(=O)NCC(=O)NC1CC1)c1nc2ccc(cc2s1)-c1ccc(NC(=O)CO)cc1
InChI Key InChIKey=XUENUJLTDRHGBJ-UHFFFAOYSA-N
Data  1 IC50
  Tab Delimited (TSV)   2D SDfile   Computed 3D by Vconf -m prep SDfile
Find this compound or compounds like it in BindingDB:
Activity Spreadsheet -- Enzyme Inhibition Constant Data from BindingDB
Found 1 hit for monomerid = 319057
TargetEndothelial lipase(Homo sapiens (Human))
Bristol-Myers Squibb
US Patent
LigandPNGBDBM319057(US10173991, Example 100 | methyl N-{4-[2- ({[(cycl...)
Affinity DataIC50:  8nM. Assay description: Endothelial lipase (EL) and hepatic lipase (HL) activities were measured using a fluorescent substrate, A10070, (Invitrogen, CA) doped into an artifi...
Ligand InfoPC cidPC sid
In DepthDetails US Patent