BDBM321112 (S)-ethyl (8-((2-amino-2,4-dimethylpentyl)oxy)-1,4-dichloro-6H-isochromeno[3,4-c]pyridin-2-yl)carbamate::US10174044, Example 46
SMILES CCOC(=O)Nc1nc(Cl)c2OCc3cc(OC[C@@](C)(N)CC(C)C)ccc3-c2c1Cl
InChI Key InChIKey=GPKRKWRMJKUJCR-QFIPXVFZSA-N
Data  1 IC50
  Tab Delimited (TSV)   2D SDfile   Computed 3D by Vconf -m prep SDfile
Find this compound or compounds like it in BindingDB:
Activity Spreadsheet -- Enzyme Inhibition Constant Data from BindingDB
Found 1 hit for monomerid = 321112
TargetAP2-associated protein kinase 1(Homo sapiens (Human))
Bristol-Myers Squibb
US Patent
LigandPNGBDBM321112((S)-ethyl (8-((2-amino-2,4-dimethylpentyl)oxy)-1,4...)
Affinity DataIC50:  45nM. Assay description: The assays were performed in U-bottom 384-well plates. The final assay volume was 30 μl prepared from 15 μl additions of enzyme and substra...
Ligand InfoPC cidPC sid
In DepthDetails US Patent