BDBM321143 US10174049, Example 10::US10385066, Example 10::US9738658, Example 10::US9796729, 10
SMILES Nc1ncnc2OCCN(c3ccc4n(ccc4c3)-c3cc(Cl)cc(Cl)c3)C(=O)c12
InChI Key InChIKey=VYKZCMYKWHNUOI-UHFFFAOYSA-N
Data  4 IC50
  Tab Delimited (TSV)   2D SDfile   Computed 3D by Vconf -m prep SDfile
Find this compound or compounds like it in BindingDB:
Activity Spreadsheet -- Enzyme Inhibition Constant Data from BindingDB
Found 4 hits for monomerid = 321143
TargetDiacylglycerol O-acyltransferase 1(Homo sapiens (Human))
Glaxosmithkline
US Patent
LigandPNGBDBM321143(US10174049, Example 10 | US10385066, Example 10 | ...)
Affinity DataIC50:  7.90nM. Assay description: For inhibition of triacylglycerol product formation, 11 uL reactions were run in white Polyplate-384 (PerkinElmer6007300) starting with a 30 minute p...
Ligand InfoPC cidPC sid
In DepthDetails US Patent
TargetDiacylglycerol O-acyltransferase 1(Homo sapiens (Human))
Glaxosmithkline
US Patent
LigandPNGBDBM321143(US10174049, Example 10 | US10385066, Example 10 | ...)
Affinity DataIC50:  7.90nM. Assay description: LE assay: For inhibition of triacylglycerol product formation, 11 uL, reactions were nm in white Polyplate-384 (PerkinElmer6007300) starting with a 3...
Ligand InfoPC cidPC sid
In DepthDetails US Patent
TargetDiacylglycerol O-acyltransferase 1(Homo sapiens (Human))
Glaxosmithkline
US Patent
LigandPNGBDBM321143(US10174049, Example 10 | US10385066, Example 10 | ...)
Affinity DataIC50:  7.90nM. Assay description: For inhibition of triacylglycerol product formation, 11 uL reactions were run in white Polyplate-384 (PerkinElmer6007300) starting with a 30 minute p...
Ligand InfoPC cidPC sid
In DepthDetails US Patent
TargetDiacylglycerol O-acyltransferase 1(Homo sapiens (Human))
Glaxosmithkline
US Patent
LigandPNGBDBM321143(US10174049, Example 10 | US10385066, Example 10 | ...)
Affinity DataIC50:  7.90nM. Assay description: For inhibition of triacylglycerol product formation, 11 uL reactions were run in white Polyplate-384 (PerkinElmer6007300) starting with a 30 minute p...
Ligand InfoPC cidPC sid
In DepthDetails US Patent