BDBM327344 US9663460, Example 150::tert-butyl {4-[({2-[(1-benzofuran-2-ylsulfonyl)-amino]-4-chlorophenyl}sulfonyl)methyl]pyridin-2-yl}carbamate
SMILES CC(C)(C)OC(=O)Nc1cc(CS(=O)(=O)c2ccc(Cl)cc2NS(=O)(=O)c2cc3ccccc3o2)ccn1
InChI Key InChIKey=JXZNZVXUIDCHPH-UHFFFAOYSA-N
Data  1 IC50
  Tab Delimited (TSV)   2D SDfile   Computed 3D by Vconf -m prep SDfile
Find this compound or compounds like it in BindingDB:
Activity Spreadsheet -- Enzyme Inhibition Constant Data from BindingDB
Found 1 hit for monomerid = 327344
TargetC-C chemokine receptor type 2(Homo sapiens (Human))
Allergan
US Patent
LigandPNGBDBM327344(US9663460, Example 150 | tert-butyl {4-[({2-[(1-be...)
Affinity DataIC50:  2.26E+3nM. Assay description: HEK-Gqi5 cells stably expressing CCR2 were cultured in (DMEM high glucose, 10% FBS, 1% PSA, 400 μg/ml geneticin and 50 μg/ml hygromycin. Ap...
Ligand InfoPC cidPC sid
In DepthDetails US Patent