BDBM334272 2-Hydroxy-2- methyl-hexanoic acid (2-bromo- 6-methoxy- pyridin-4-yl)-amide::US9732044, 8
SMILES CCCCC(C)(O)C(=O)Nc1cc(Br)nc(OC)c1
InChI Key InChIKey=HEMLLEMCCCVSNY-UHFFFAOYSA-N
Data  1 Kd
  Tab Delimited (TSV)   2D SDfile   Computed 3D by Vconf -m prep SDfile
Find this compound or compounds like it in BindingDB:
Activity Spreadsheet -- Enzyme Inhibition Constant Data from BindingDB
Found 1 hit for monomerid = 334272
TargetAndrogen receptor(Homo sapiens (Human))
Galderma Research & Development
US Patent
LigandPNGBDBM334272(2-Hydroxy-2- methyl-hexanoic acid (2-bromo- 6-meth...)
Affinity DataKd:  30nM. Assay description: The N-(pyrid-4-yl)amides and N-(pyrimidin-4-yl)amides described herein exhibit androgen receptor (AR) inhibiting properties. This AR inhibiting activ...
Ligand InfoPC cidPC sid
In DepthDetails US Patent