BDBM339227 US10201546, Example 112c::US10201546, Example 191c
SMILES COc1nc2ccc(cc2c(Cl)c1CN1CCC(CC1)C(F)(F)F)[C@](O)(c1cncn1C)c1ccc(nc1)C(F)(F)F
InChI Key InChIKey=VPAFDEDTWDQIJF-AREMUKBSSA-N
Data  4 IC50  3 Kd
  Tab Delimited (TSV)   2D SDfile   Computed 3D by Vconf -m prep SDfile
Find this compound or compounds like it in BindingDB:
Activity Spreadsheet -- Enzyme Inhibition Constant Data from BindingDB
Found 7 hits for monomerid = 339227
TargetNuclear receptor ROR-gamma(Homo sapiens (Human))
Janssen Pharmaceutica
US Patent
LigandPNGBDBM339227(US10201546, Example 112c | US10201546, Example 191...)
Affinity DataKd:  3nM. Assay description: ThermoFluor is a fluorescence based assay that estimates ligand binding affinities by measuring the effect of a ligand on protein thermal stability (...
Ligand InfoPC cidPC sid
In DepthDetails US Patent
TargetNuclear receptor ROR-gamma(Homo sapiens (Human))
Janssen Pharmaceutica
US Patent
LigandPNGBDBM339227(US10201546, Example 112c | US10201546, Example 191...)
Affinity DataIC50:  61nM. Assay description: For the RORγt construct used in the ThermoFluorŪ assay, numbering for the nucleotide sequences was based on the reference sequence for human ROR...
Ligand InfoPC cidPC sid
In DepthDetails US Patent
TargetNuclear receptor ROR-gamma(Homo sapiens (Human))
Janssen Pharmaceutica
US Patent
LigandPNGBDBM339227(US10201546, Example 112c | US10201546, Example 191...)
Affinity DataKd:  3.10nM. Assay description: ThermoFluor is a fluorescence based assay that estimates ligand binding affinities by measuring the effect of a ligand on protein thermal stability (...
Ligand InfoPC cidPC sid
In DepthDetails US Patent
TargetNuclear receptor ROR-gamma(Homo sapiens (Human))
Janssen Pharmaceutica
US Patent
LigandPNGBDBM339227(US10201546, Example 112c | US10201546, Example 191...)
Affinity DataKd:  1.10nM. Assay description: Displacement of thermofluor from human recombinant N-terminal TEV cleavage site-fused-His-tagged RORgammat LBD expressed in Escherichia coli assessed...
Ligand InfoPC cidPC sid
In DepthDetails ArticlePubMed
TargetNuclear receptor ROR-gamma(Homo sapiens (Human))
Janssen Pharmaceutica
US Patent
LigandPNGBDBM339227(US10201546, Example 112c | US10201546, Example 191...)
Affinity DataIC50:  61nM. Assay description: Inverse agonist activity at GAL4-DNA binding domain-fused human RORgammat LBD expressed in pGL4.31 transfected HEK293T cells assessed as inhibition o...
Ligand InfoPC cidPC sid
In DepthDetails ArticlePubMed
TargetNuclear receptor ROR-gamma(Homo sapiens (Human))
Janssen Pharmaceutica
US Patent
LigandPNGBDBM339227(US10201546, Example 112c | US10201546, Example 191...)
Affinity DataIC50:  17nM. Assay description: Inverse agonist activity at RORgammat in human PBMC derived CD4-positive T cells assessed as suppression of T cell differentiation to Th17 cells by m...
Ligand InfoPC cidPC sid
In DepthDetails ArticlePubMed
TargetNuclear receptor ROR-gamma(Homo sapiens (Human))
Janssen Pharmaceutica
US Patent
LigandPNGBDBM339227(US10201546, Example 112c | US10201546, Example 191...)
Affinity DataIC50:  33nM. Assay description: A reporter assay was used to test functional activity of RORγt modulatory compounds on transcriptional activation driven by the RORγt LBD. ...
Ligand InfoPC cidPC sid
In DepthDetails US Patent