BDBM3397 2-Butanol deriv. 4::N-tert-butyl-2-(3-{[2-(tert-butylcarbamoyl)phenyl]sulfanyl}-2-hydroxypropyl)benzamide::diarylbutanol deriv. 4::tert-Butyl-2-[3-[[2-(tert-Butylcarbamoyl)phenyl]sulfanyl]-2-hydroxypropyl]benzamide
SMILES CC(C)(C)NC(=O)c1ccccc1CC(O)CSc1ccccc1C(=O)NC(C)(C)C
InChI Key InChIKey=XXMWJVHFFWXJGR-UHFFFAOYSA-N
Data  2 KI
  Tab Delimited (TSV)   2D SDfile   Computed 3D by Vconf -m prep SDfile
Find this compound or compounds like it in BindingDB:
Activity Spreadsheet -- Enzyme Inhibition Constant Data from BindingDB
Found 2 hits for monomerid = 3397
TargetDimer of Gag-Pol polyprotein [489-587](Human immunodeficiency virus type 1)
Agouron Pharmaceuticals
LigandPNGBDBM3397(2-Butanol deriv. 4 | N-tert-butyl-2-(3-{[2-(tert-b...)
Affinity DataKi:  8.30E+4nM ΔG°:  -5.79kcal/molepH: 5.6 T: 2°C. Assay description: Protease activity was measured by continuous chromogenic assay. The chromogenic peptide His-Lys-Ala-Arg-Val-Leu- (p-NO2-Phe)-Glu-Ala-Nleu-Ser (Bache...
In DepthDetails ArticlePubMed
TargetDimer of Gag-Pol polyprotein [489-587](Human immunodeficiency virus type 1)
Agouron Pharmaceuticals
LigandPNGBDBM3397(2-Butanol deriv. 4 | N-tert-butyl-2-(3-{[2-(tert-b...)
Affinity DataKi:  8.30E+4nM ΔG°:  -5.79kcal/molepH: 5.6 T: 2°C. Assay description: Protease activity was measured by continuous chromogenic assay. The chromogenic peptide His-Lys-Ala-Arg-Val-Leu- (p-NO2-Phe)-Glu-Ala-Nleu-Ser (Bache...
In DepthDetails ArticlePubMed