BDBM3401 2-Butanol deriv. 8::2-[4-[2-(tert-Butylcarbamoyl)phenyl]-2-hydroxybutyl]-benzoic Acid tert-Butyl Amide::AG1132::N-tert-butyl-2-{4-[2-(tert-butylcarbamoyl)phenyl]-3-hydroxybutyl}benzamide::diarylbutanol deriv. 5
SMILES CC(C)(C)NC(=O)c1ccccc1CCC(O)Cc1ccccc1C(=O)NC(C)(C)C
InChI Key InChIKey=FGWJLASYSLJOQW-UHFFFAOYSA-N
Data  3 KI
  Tab Delimited (TSV)   2D SDfile   Computed 3D by Vconf -m prep SDfile
Find this compound or compounds like it in BindingDB:
Activity Spreadsheet -- Enzyme Inhibition Constant Data from BindingDB
Found 3 hits for monomerid = 3401
TargetDimer of Gag-Pol polyprotein [489-587](Human immunodeficiency virus type 1)
Agouron Pharmaceuticals
LigandPNGBDBM3401(2-Butanol deriv. 8 | 2-[4-[2-(tert-Butylcarbamoyl)...)
Affinity DataKi:  2.00E+4nM ΔG°:  -6.66kcal/molepH: 5.6 T: 2°C. Assay description: Protease activity was measured by continuous chromogenic assay. The chromogenic peptide His-Lys-Ala-Arg-Val-Leu-(p-NO2-Phe)-Glu-Ala-Nleu-Ser was use...
In DepthDetails ArticlePubMed
TargetDimer of Gag-Pol polyprotein [489-587](Human immunodeficiency virus type 1)
Agouron Pharmaceuticals
LigandPNGBDBM3401(2-Butanol deriv. 8 | 2-[4-[2-(tert-Butylcarbamoyl)...)
Affinity DataKi:  2.40E+4nM ΔG°:  -6.55kcal/molepH: 5.6 T: 2°C. Assay description: Protease activity was measured by continuous chromogenic assay. The chromogenic peptide His-Lys-Ala-Arg-Val-Leu- (p-NO2-Phe)-Glu-Ala-Nleu-Ser (Bache...
In DepthDetails ArticlePubMed
TargetDimer of Gag-Pol polyprotein [489-587](Human immunodeficiency virus type 1)
Agouron Pharmaceuticals
LigandPNGBDBM3401(2-Butanol deriv. 8 | 2-[4-[2-(tert-Butylcarbamoyl)...)
Affinity DataKi:  2.40E+4nM ΔG°:  -6.55kcal/molepH: 5.6 T: 2°C. Assay description: Protease activity was measured by continuous chromogenic assay. The chromogenic peptide His-Lys-Ala-Arg-Val-Leu- (p-NO2-Phe)-Glu-Ala-Nleu-Ser (Bache...
In DepthDetails ArticlePubMed