BDBM34199 3-methyl-7-[(4-methylphenyl)methyl]-8-(2-methylpropylsulfanyl)purine-2,6-dione::3-methyl-7-[(4-methylphenyl)methyl]-8-(2-methylpropylthio)purine-2,6-dione::8-(isobutylthio)-3-methyl-7-(4-methylbenzyl)xanthine::8-Isobutylsulfanyl-3-methyl-7-(4-methyl-benzyl)-3,7-dihydro-purine-2,6-dione::MLS000026962::SMR000009756::cid_647715
SMILES CC(C)CSc1nc2n(C)c(=O)[nH]c(=O)c2n1Cc1ccc(C)cc1
InChI Key InChIKey=WNNVCUBRMUPPQE-UHFFFAOYSA-N
Data  1 IC50
  Tab Delimited (TSV)   2D SDfile   Computed 3D by Vconf -m prep SDfile
Find this compound or compounds like it in BindingDB:
Activity Spreadsheet -- Enzyme Inhibition Constant Data from BindingDB
Found 1 hit for monomerid = 34199
TargetGag-Pol polyprotein(Human immunodeficiency virus type 1 group M subtyp...)
University Of Pittsburgh
Curated by PubChem BioAssay
LigandPNGBDBM34199(3-methyl-7-[(4-methylphenyl)methyl]-8-(2-methylpro...)
Affinity DataIC50:  1.71E+3nMpH: 8.0 T: 2°C. Assay description: A fluorescence resonance energy transfer assay is developed in 96-well and 384-well microplate formats with robotic manipulation to enable high-throu...
In DepthDetails PCBioAssay