BDBM3424 2-[(2R)-4-{2-[(1-ethylcyclopentyl)(2-hydroxyethyl)carbamoyl]phenyl}-2-hydroxybutyl]-N-(2-hydroxyethyl)-5-methyl-N-(2-phenylpropan-2-yl)benzamide::diarylbutanol deriv. 12R
SMILES CCC1(CCCC1)N(CCO)C(=O)c1ccccc1CC[C@@H](O)Cc1ccc(C)cc1C(=O)N(CCO)C(C)(C)c1ccccc1
InChI Key InChIKey=MBNPLZRTGOAFGX-MGBGTMOVSA-N
Data  1 KI
  Tab Delimited (TSV)   2D SDfile   Computed 3D by Vconf -m prep SDfile
Find this compound or compounds like it in BindingDB:
Activity Spreadsheet -- Enzyme Inhibition Constant Data from BindingDB
Found 1 hit for monomerid = 3424
TargetDimer of Gag-Pol polyprotein [489-587](Human immunodeficiency virus type 1)
Agouron Pharmaceuticals
LigandPNGBDBM3424(2-[(2R)-4-{2-[(1-ethylcyclopentyl)(2-hydroxyethyl)...)
Affinity DataKi:  4.80nM ΔG°:  -11.8kcal/molepH: 5.6 T: 2°C. Assay description: Protease activity was measured by continuous chromogenic assay. The chromogenic peptide His-Lys-Ala-Arg-Val-Leu- (p-NO2-Phe)-Glu-Ala-Nleu-Ser (Bache...
In DepthDetails ArticlePubMed