BDBM351924 US9796729, 7
SMILES Nc1ncnc2OCCN(c3ccc4n(ccc4c3)-c3ccccc3OC(F)F)C(=O)c12
InChI Key InChIKey=ZRRGNUNCHOBNLQ-UHFFFAOYSA-N
Data  1 IC50
  Tab Delimited (TSV)   2D SDfile   Computed 3D by Vconf -m prep SDfile
Find this compound or compounds like it in BindingDB:
Activity Spreadsheet -- Enzyme Inhibition Constant Data from BindingDB
Found 1 hit for monomerid = 351924
TargetDiacylglycerol O-acyltransferase 1(Homo sapiens (Human))
Glaxosmithkline
US Patent
LigandPNGBDBM351924(US9796729, 7)
Affinity DataIC50:  3.20nM. Assay description: For inhibition of triacylglycerol product formation, 11 uL reactions were run in white Polyplate-384 (PerkinElmer6007300) starting with a 30 minute p...
Ligand InfoPC cidPC sid
In DepthDetails US Patent