BDBM355069 US9815796, Example 160::methyl 4-(1-methyl-1-{[(6-oxo-2- phenyl-1,6-dihydropyrimidin-4- yl)carbonyl]amino}ethyl)benzoate
SMILES COC(=O)c1ccc(cc1)C(C)(C)NC(=O)c1cc(=O)[nH]c(n1)-c1ccccc1
InChI Key InChIKey=BQMAUZQKOPODKX-UHFFFAOYSA-N
Data  1 KI
  Tab Delimited (TSV)   2D SDfile   Computed 3D by Vconf -m prep SDfile
Find this compound or compounds like it in BindingDB:
Activity Spreadsheet -- Enzyme Inhibition Constant Data from BindingDB
Found 1 hit for monomerid = 355069
TargetPhosphodiesterase(Macaca mulatta (Rhesus macaque))
Merck Sharp & Dohme
US Patent
LigandPNGBDBM355069(US9815796, Example 160 | methyl 4-(1-methyl-1-{[(6...)
Affinity DataKi:  826nM. Assay description: In a typical experiment the PDE2 inhibitory activity of the compounds of the present invention was determined in accordance with the following experi...
Ligand InfoPC cidPC sid
In DepthDetails US Patent