BDBM355341 US9815796, Example 432::ethyl 4-[(1R)-1-{[(6-oxo-1,6-dihydro- 2,2'-bipyrimidin-4- yl)carbonyl]amino}ethyl]benzoate
SMILES CCOC(=O)c1ccc(cc1)[C@@H](C)NC(=O)c1cc(=O)[nH]c(n1)-c1ncccn1
InChI Key
Data  1 KI
  Tab Delimited (TSV)   2D SDfile   Computed 3D by Vconf -m prep SDfile
Find this compound or compounds like it in BindingDB:
Activity Spreadsheet -- Enzyme Inhibition Constant Data from BindingDB
Found 1 hit for monomerid = 355341
TargetPhosphodiesterase(Macaca mulatta (Rhesus macaque))
Merck Sharp & Dohme
US Patent
LigandPNGBDBM355341(US9815796, Example 432 | ethyl 4-[(1R)-1-{[(6-oxo-...)
Affinity DataKi: >2.97E+3nM. Assay description: In a typical experiment the PDE2 inhibitory activity of the compounds of the present invention was determined in accordance with the following experi...
Ligand InfoPC cidPC sid
In DepthDetails US Patent