BDBM357210 US10214512, Example 151-a
SMILES COC(=O)Nc1ccc2-c3nc([nH]c3C)[C@H](C[C@H](C)CCC(=O)Nc2c1)c1ccc(c[n+]1[O-])-c1c(F)ccc(Cl)c1F
InChI Key
Data  2 KI
  Tab Delimited (TSV)   2D SDfile   Computed 3D by Vconf -m prep SDfile
Find this compound or compounds like it in BindingDB:
Activity Spreadsheet -- Enzyme Inhibition Constant Data from BindingDB
Found 2 hits for monomerid = 357210
TargetCoagulation factor XI(Homo sapiens (Human))
Merck Sharp & Dohme
US Patent
LigandPNGBDBM357210(US10214512, Example 151-a)
Affinity DataKi:  0.0400nM. Assay description: The effectiveness of a compound of the present invention as an inhibitor of Coagulation Factor XIa can be determined using a relevant purified serine...
Ligand InfoPC cidPC sid
In DepthDetails US Patent
TargetKallikrein-1(Homo sapiens (Human))
Merck Sharp & Dohme
US Patent
LigandPNGBDBM357210(US10214512, Example 151-a)
Affinity DataKi:  0.160nM. Assay description: The effectiveness of a compound of the present invention as an inhibitor of Kallikrein can be determined using a relevant purified serine protease, a...
Ligand InfoPC cidPC sid
In DepthDetails US Patent