BDBM360193 (R)-(1-methylpyrrolidin-2-yl)-methyl (3'-methyl-[1,1'-biphenyl]-2-yl)carbamate::US9828339, Example 110
SMILES CN1CCC[C@@H]1COC(=O)Nc1ccccc1-c1cccc(C)c1
InChI Key InChIKey=CUWCIUNJZHEGTQ-QGZVFWFLSA-N
Data  1 KI
  Tab Delimited (TSV)   2D SDfile   Computed 3D by Vconf -m prep SDfile
Find this compound or compounds like it in BindingDB:
Activity Spreadsheet -- Enzyme Inhibition Constant Data from BindingDB
Found 1 hit for monomerid = 360193
TargetMuscarinic acetylcholine receptor M3(Homo sapiens (Human))
Dong-A St
US Patent
LigandPNGBDBM360193((R)-(1-methylpyrrolidin-2-yl)-methyl (3'-methyl-[1...)
Affinity DataKi:  9.13nM. Assay description: Cell membrane proteins (Perkin Elmer) wherein human muscarinic M3 receptor was overexpressed, [3H]-methyl scopolamine and test compounds in various c...
Ligand InfoPC cidPC sid
In DepthDetails US Patent