BDBM360220 (R)-(1-methylpyrrolidin-3-yl)-methyl (3'-chloro-4'-fluoro-[1,1'-biphenyl]-2-yl)carbamate::US9828339, Example 136
SMILES CN1CC[C@@H](COC(=O)Nc2ccccc2-c2ccc(F)c(Cl)c2)C1
InChI Key InChIKey=SYBGVVSJNMTWCI-CYBMUJFWSA-N
Data  1 KI
  Tab Delimited (TSV)   2D SDfile   Computed 3D by Vconf -m prep SDfile
Find this compound or compounds like it in BindingDB:
Activity Spreadsheet -- Enzyme Inhibition Constant Data from BindingDB
Found 1 hit for monomerid = 360220
TargetMuscarinic acetylcholine receptor M3(Homo sapiens (Human))
Dong-A St
US Patent
LigandPNGBDBM360220((R)-(1-methylpyrrolidin-3-yl)-methyl (3'-chloro-4'...)
Affinity DataKi:  1.59nM. Assay description: Cell membrane proteins (Perkin Elmer) wherein human muscarinic M3 receptor was overexpressed, [3H]-methyl scopolamine and test compounds in various c...
In DepthDetails US Patent