BDBM365848 1-({3-methyl-4-[(2-methyl-3- phenylphenyl)methoxy]phenyl} methyl)azetidine::US9872852, Example 100
SMILES Cc1cc(CN2CCC2)ccc1OCc1cccc(c1C)-c1ccccc1
InChI Key InChIKey=RUJGJXQLELAMPZ-UHFFFAOYSA-N
Data  1 IC50
  Tab Delimited (TSV)   2D SDfile   Computed 3D by Vconf -m prep SDfile
Find this compound or compounds like it in BindingDB:
Activity Spreadsheet -- Enzyme Inhibition Constant Data from BindingDB
Found 1 hit for monomerid = 365848
TargetProgrammed cell death 1 ligand 1(Homo sapiens (Human))
Bristol-Myers Squibb
US Patent
LigandPNGBDBM365848(1-({3-methyl-4-[(2-methyl-3- phenylphenyl)methoxy]...)
Affinity DataIC50:  555nM. Assay description: All binding studies were performed in an HTRF assay buffer consisting of dPBS supplemented with 0.1% (withv) bovine serum albumin and 0.05% (v/v) Twe...
Ligand InfoPC cidPC sid
In DepthDetails US Patent