BDBM370530 (1R,4s)-4-(2-((S)-6-fluoro-5H-imidazo[5,1- a]isoindol-5-yl)-1-hydroxyethyl)cyclohexyl benzoate::US10233190, Example 1455
SMILES OC(CC1c2c(cccc2F)-c2cncn12)[C@@H]1CC[C@@H](CC1)OC(=O)c1ccccc1
InChI Key InChIKey=NTBNOWXFZMDXDZ-FEMPOIPRSA-N
Data  1 IC50
  Tab Delimited (TSV)   2D SDfile   Computed 3D by Vconf -m prep SDfile
Find this compound or compounds like it in BindingDB:
Activity Spreadsheet -- Enzyme Inhibition Constant Data from BindingDB
Found 1 hit for monomerid = 370530
TargetIndoleamine 2,3-dioxygenase 1(Homo sapiens (Human))
Newlink Genetics
US Patent
LigandPNGBDBM370530((1R,4s)-4-(2-((S)-6-fluoro-5H-imidazo[5,1- a]isoin...)
Affinity DataIC50: <1.00E+3nM. Assay description: The IC50 values for each compound were determined by testing the activity of IDO in a mixture containing 50 mM potassium phosphate buffer at pH 6.5; ...
Ligand InfoPC cidPC sid
In DepthDetails US Patent