BDBM37618 2-(dimethylamino)ethyl 2-cyclohexyl-2-hydroxy-2-phenylacetate;hydrochloride::2-(dimethylamino)ethyl 2-cyclohexyl-2-oxidanyl-2-phenyl-ethanoate;hydrochloride::2-cyclohexyl-2-hydroxy-2-phenyl-acetic acid 2-(dimethylamino)ethyl ester;hydrochloride::2-cyclohexyl-2-hydroxy-2-phenylacetic acid 2-(dimethylamino)ethyl ester;hydrochloride::Cyclohexyl-hydroxy-phenyl-acetic acid 2-dimethylamino-ethyl ester::MLS000068648::SMR000012218::cid_3083979
SMILES CN(C)CCOC(=O)C(O)(C1CCCCC1)c1ccccc1
InChI Key InChIKey=BGUILKOLBPOILU-UHFFFAOYSA-N
Data  2 KI  2 IC50
  Tab Delimited (TSV)   2D SDfile   Computed 3D by Vconf -m prep SDfile
Find this compound or compounds like it in BindingDB:
Activity Spreadsheet -- Enzyme Inhibition Constant Data from BindingDB
Found 2 hits for monomerid = 37618
TargetN-formyl peptide receptor 2(Homo sapiens (Human))
Nmmlsc
Curated by PubChem BioAssay
LigandPNGBDBM37618(2-(dimethylamino)ethyl 2-cyclohexyl-2-hydroxy-2-ph...)
Affinity DataIC50: >6.67E+4nM. Assay description: University of New Mexico Assay Overview Assay Support: NIH 1R03MH076381-01 Assay for Formylpeptide Receptor Family Ligands PI: Bruce S. Edwards, Ph....
In DepthDetails PCBioAssay
TargetfMet-Leu-Phe receptor(Homo sapiens (Human))
Nmmlsc
Curated by PubChem BioAssay
LigandPNGBDBM37618(2-(dimethylamino)ethyl 2-cyclohexyl-2-hydroxy-2-ph...)
Affinity DataIC50: >6.67E+4nM. Assay description: University of New Mexico Assay Overview: Assay Support: NIH 1R03MH076381-01 Assay for Formylpeptide Receptor Family Ligands PI: Bruce S. Edwards, Ph...
In DepthDetails PCBioAssay