BDBM37707 (2Z)-2-amino-3-({(1E)-[4-(diethylamino)phenyl]methylene}amino)but-2-enedinitrile::(Z)-2-amino-3-[[4-(diethylamino)benzylidene]amino]but-2-enedinitrile::(Z)-2-amino-3-[[4-(diethylamino)phenyl]methylideneamino]-2-butenedinitrile::(Z)-2-amino-3-[[4-(diethylamino)phenyl]methylideneamino]but-2-enedinitrile::(Z)-2-azanyl-3-[[4-(diethylamino)phenyl]methylideneamino]but-2-enedinitrile::MLS000087650::SMR000023871::cid_3238678
SMILES CCN(CC)c1ccc(C=NC(C#N)C(=N)C#N)cc1
InChI Key InChIKey=CHKHMJMRQOVNNZ-UHFFFAOYSA-N
Data  2 KI  3 IC50  3 EC50
  Tab Delimited (TSV)   2D SDfile   Computed 3D by Vconf -m prep SDfile
Find this compound or compounds like it in BindingDB:
Activity Spreadsheet -- Enzyme Inhibition Constant Data from BindingDB
Found 2 hits for monomerid = 37707
TargetN-formyl peptide receptor 2(Homo sapiens (Human))
Nmmlsc
Curated by PubChem BioAssay
LigandPNGBDBM37707((2Z)-2-amino-3-({(1E)-[4-(diethylamino)phenyl]meth...)
Affinity DataKi: >4.03E+4nM. Assay description: University of New Mexico Assay Overview Assay Support: NIH 1R03MH076381-01 Assay for Formylpeptide Receptor Family Ligands PI: Bruce S. Edwards, Ph....
Ligand InfoPC cidPC sid
In DepthDetails PCBioAssay
TargetN-formyl peptide receptor 2(Homo sapiens (Human))
Nmmlsc
Curated by PubChem BioAssay
LigandPNGBDBM37707((2Z)-2-amino-3-({(1E)-[4-(diethylamino)phenyl]meth...)
Affinity DataIC50: >6.67E+4nM. Assay description: University of New Mexico Assay Overview Assay Support: NIH 1R03MH076381-01 Assay for Formylpeptide Receptor Family Ligands PI: Bruce S. Edwards, Ph....
Ligand InfoPC cidPC sid
In DepthDetails PCBioAssay