BDBM380477 US9926306, ID 183-38
SMILES Cc1cs\c(=N/C2CCCCC2)n1\N=C\c1ccc(O)c(O)c1
InChI Key InChIKey=SRUOIXANLLINOA-MNVAPZAZSA-N
Data  1 IC50
  Tab Delimited (TSV)   2D SDfile   Computed 3D by Vconf -m prep SDfile
Find this compound or compounds like it in BindingDB:
Activity Spreadsheet -- Enzyme Inhibition Constant Data from BindingDB
Found 1 hit for monomerid = 380477
TargetInduced myeloid leukemia cell differentiation protein Mcl-1 homolog(Mus musculus (Mouse))
Dana-Farber Cancer Institute
US Patent
LigandPNGBDBM380477(US9926306, ID 183-38)
Affinity DataIC50:  12nM. Assay description: A high-throughput competitive fluorescence polarization (FP) screening assay (Z-factor, 0.62) was developed based on the direct binding interaction b...
Ligand InfoPC cidPC sid
In DepthDetails US Patent