BDBM382181 (1S,4s)-4-fluoro-4-((3aR,9bR)-9b-((4-fluorophenyl)sulfonyl)-7-(perfluoropropan-2-yl)-2,3,3a,4,5,9b-hexahydro-1H-benzo[e]indole-3-carbonyl)cyclohexane-1-carboxylic acid and (1S,4s)-1-fluoro-4-((3aR,9bR)-9b-((4-fluorophenyl)sulfonyl)-7-(perfluoropropan-2-yl)-2,3,3a,4,5,9b-hexahydro-1H-benzo[e]indole-3-carbonyl)cyclohexane-1-carboxylic acid::US10273259, Example 3
SMILES OC(=O)[C@H]1CC[C@@](F)(CC1)C(=O)N1CC[C@@]2([C@H]1CCc1cc(ccc21)C(F)(C(F)(F)F)C(F)(F)F)S(=O)(=O)c1ccc(F)cc1
InChI Key InChIKey=IXBCMUKVFIGIKH-PNOGGZOTSA-N
Data  6 IC50  2 EC50
  Tab Delimited (TSV)   2D SDfile   Computed 3D by Vconf -m prep SDfile
Find this compound or compounds like it in BindingDB:
Activity Spreadsheet -- Enzyme Inhibition Constant Data from BindingDB
Found 8 hits for monomerid = 382181
TargetNuclear receptor ROR-gamma(Mus musculus)
Bristol-Myers Squibb
US Patent
LigandPNGBDBM382181((1S,4s)-4-fluoro-4-((3aR,9bR)-9b-((4-fluorophenyl)...)
Affinity DataIC50:  65nM. Assay description: The binding of potential ligands to RORγ is measured by competition with [3H]25-hydroxycholesterol (Perkin Elmer NET674250UC) using a scintillat...
Ligand InfoPC cidPC sid
In DepthDetails US Patent
TargetNuclear receptor subfamily 1 group I member 2(Homo sapiens (Human))
Bristol-Myers Squibb
Curated by ChEMBL
LigandPNGBDBM382181((1S,4s)-4-fluoro-4-((3aR,9bR)-9b-((4-fluorophenyl)...)
Affinity DataIC50: >4.00E+4nM. Assay description: Activity at PXR (unknown origin)
Ligand InfoPC cidPC sid
In DepthDetails ArticlePubMed
TargetNuclear receptor ROR-alpha(Homo sapiens (Human))
Bristol-Myers Squibb
Curated by ChEMBL
LigandPNGBDBM382181((1S,4s)-4-fluoro-4-((3aR,9bR)-9b-((4-fluorophenyl)...)
Affinity DataIC50: >1.00E+4nM. Assay description: Activity at RORalpha (unknown origin)
Ligand InfoPC cidPC sid
In DepthDetails ArticlePubMed
TargetOxysterols receptor LXR-beta(Homo sapiens (Human))
Bristol-Myers Squibb
Curated by ChEMBL
LigandPNGBDBM382181((1S,4s)-4-fluoro-4-((3aR,9bR)-9b-((4-fluorophenyl)...)
Affinity DataIC50: >1.00E+4nM. Assay description: Activity at LXRbeta (unknown origin)
Ligand InfoPC cidPC sid
In DepthDetails ArticlePubMed
TargetNuclear receptor ROR-gamma(Homo sapiens (Human))
Bristol-Myers Squibb
Curated by ChEMBL
LigandPNGBDBM382181((1S,4s)-4-fluoro-4-((3aR,9bR)-9b-((4-fluorophenyl)...)
Affinity DataEC50:  15nM. Assay description: Inverse agonist activity at full length human RORgammat expressed in human Jurkat cells assessed as inhibition of constitutive receptor activity incu...
Ligand InfoPC cidPC sid
In DepthDetails ArticlePubMed
TargetNuclear receptor ROR-beta(Homo sapiens (Human))
Bristol-Myers Squibb
Curated by ChEMBL
LigandPNGBDBM382181((1S,4s)-4-fluoro-4-((3aR,9bR)-9b-((4-fluorophenyl)...)
Affinity DataIC50: >1.00E+4nM. Assay description: Activity at RORbeta (unknown origin)
Ligand InfoPC cidPC sid
In DepthDetails ArticlePubMed
TargetOxysterols receptor LXR-alpha(Homo sapiens (Human))
Bristol-Myers Squibb
Curated by ChEMBL
LigandPNGBDBM382181((1S,4s)-4-fluoro-4-((3aR,9bR)-9b-((4-fluorophenyl)...)
Affinity DataIC50: >1.00E+4nM. Assay description: Activity at LXRalpha (unknown origin)
Ligand InfoPC cidPC sid
In DepthDetails ArticlePubMed
TargetNuclear receptor ROR-gamma(Homo sapiens (Human))
Bristol-Myers Squibb
Curated by ChEMBL
LigandPNGBDBM382181((1S,4s)-4-fluoro-4-((3aR,9bR)-9b-((4-fluorophenyl)...)
Affinity DataEC50:  46nM. Assay description: Inverse agonist activity at RORgammat in CD3 and CD28-stimulated human whole blood assessed as reduction in IL17A production incubated for 1 hr befor...
Ligand InfoPC cidPC sid
In DepthDetails ArticlePubMed