BDBM38460 4,5-dimethoxy-2-[(3-methylbenzofuran-2-carbonyl)amino]benzoic acid methyl ester::4,5-dimethoxy-2-[[(3-methyl-2-benzofuranyl)-oxomethyl]amino]benzoic acid methyl ester::MLS000051775::SMR000080757::cid_1247297::methyl 4,5-dimethoxy-2-[(3-methyl-1-benzofuran-2-carbonyl)amino]benzoate::methyl 4,5-dimethoxy-2-[(3-methyl-1-benzofuran-2-yl)carbonylamino]benzoate::methyl 4,5-dimethoxy-2-{[(3-methyl-1-benzofuran-2-yl)carbonyl]amino}benzoate
SMILES COC(=O)c1cc(OC)c(OC)cc1NC(=O)c1oc2ccccc2c1C
InChI Key InChIKey=GWVSLYKQXAREDE-UHFFFAOYSA-N
Data  1 IC50
  Tab Delimited (TSV)   2D SDfile   Computed 3D by Vconf -m prep SDfile
Find this compound or compounds like it in BindingDB:
Activity Spreadsheet -- Enzyme Inhibition Constant Data from BindingDB
Found 1 hit for monomerid = 38460
TargetDiphosphomevalonate decarboxylase(Streptococcus pneumoniae D39)
Srmlsc
Curated by PubChem BioAssay
LigandPNGBDBM38460(4,5-dimethoxy-2-[(3-methylbenzofuran-2-carbonyl)am...)
Affinity DataIC50: >1.00E+7nM. Assay description: Southern Research Molecular Libraries Screening Center (SRMLSC) Southern Research Institute (Birmingham, Alabama) NIH Molecular Libraries Screening C...
In DepthDetails PCBioAssay