BDBM387588 N3-(3-Chloro-4- fluorophenyl)- 5-fluoro-7- (pyridin-4- yl)furo[2,3- c]pyridine-2,3- diamine::US10294212, No. 180
SMILES Nc1oc2c(nc(F)cc2c1Nc1ccc(F)c(Cl)c1)-c1ccncc1
InChI Key InChIKey=KRHLVCLYPZEVBB-UHFFFAOYSA-N
Data  1 IC50
  Tab Delimited (TSV)   2D SDfile   Computed 3D by Vconf -m prep SDfile
Find this compound or compounds like it in BindingDB:
Activity Spreadsheet -- Enzyme Inhibition Constant Data from BindingDB
Found 1 hit for monomerid = 387588
TargetIndoleamine 2,3-dioxygenase 1(Homo sapiens (Human))
Curadev Pharma
US Patent
LigandPNGBDBM387588(N3-(3-Chloro-4- fluorophenyl)- 5-fluoro-7- (pyridi...)
Affinity DataIC50: <200nM. Assay description: Human indoleamine 2,3-dioxygenasel (hIDO1) catalyzes the oxidative cleavage of the pyrrole ring of the indole nucleus of tryptophan to yield N-formyl...
Ligand InfoPC cidPC sid
In DepthDetails US Patent