BDBM387591 2-Amino-3- ((4-fluoro-3- (trifluoro- methyl)phenyl) amino)furo [2,3-c]pyridine- 7-carbonitrile::US10294212, No. 183
SMILES Nc1oc2c(nccc2c1Nc1ccc(F)c(c1)C(F)(F)F)C#N
InChI Key InChIKey=SYENXBHURNUDIE-UHFFFAOYSA-N
Data  1 IC50
  Tab Delimited (TSV)   2D SDfile   Computed 3D by Vconf -m prep SDfile
Find this compound or compounds like it in BindingDB:
Activity Spreadsheet -- Enzyme Inhibition Constant Data from BindingDB
Found 1 hit for monomerid = 387591
TargetIndoleamine 2,3-dioxygenase 1(Homo sapiens (Human))
Curadev Pharma
US Patent
LigandPNGBDBM387591(2-Amino-3- ((4-fluoro-3- (trifluoro- methyl)phenyl...)
Affinity DataIC50: <200nM. Assay description: Human indoleamine 2,3-dioxygenasel (hIDO1) catalyzes the oxidative cleavage of the pyrrole ring of the indole nucleus of tryptophan to yield N-formyl...
Ligand InfoPC cidPC sid
In DepthDetails US Patent