BDBM392012 US10301272, Example 6/10
SMILES CC(C)(C)NS(=O)(=O)c1ccc(-c2sc(nc2CC2CCCCC2)C(=O)N2CC(C2)C(C)(C)C(O)=O)c2ccccc12
InChI Key InChIKey=NKUTUPAMPBDAJJ-UHFFFAOYSA-N
Data  4 IC50  2 Kd
  Tab Delimited (TSV)   2D SDfile   Computed 3D by Vconf -m prep SDfile
Find this compound or compounds like it in BindingDB:
Activity Spreadsheet -- Enzyme Inhibition Constant Data from BindingDB
Found 6 hits for monomerid = 392012
TargetIsoform 2 of Nuclear receptor ROR-gamma (RORgT)(Homo sapiens (Human))
Phenex Pharmaceuticals
US Patent
LigandPNGBDBM392012(US10301272, Example 6/10)
Affinity DataIC50:  100nM. Assay description: Determination of a ligand mediated Gal4 promoter driven transactivation to quantify ligand binding to RORγ was performed as follows: DNA encodin...
Ligand InfoPC cidPC sid
In DepthDetails US Patent
TargetIsoform 2 of Nuclear receptor ROR-gamma (RORgT)(Homo sapiens (Human))
Phenex Pharmaceuticals
US Patent
LigandPNGBDBM392012(US10301272, Example 6/10)
Affinity DataIC50:  2nM. Assay description: Cells were incubated for additional 16 h before firefly (FF) luciferase activities were measured sequentially in the same cell extract using a Dual-L...
Ligand InfoPC cidPC sid
In DepthDetails US Patent
TargetNuclear receptor ROR-gamma(Homo sapiens (Human))
Phenex Pharmaceuticals
Curated by ChEMBL
LigandPNGBDBM392012(US10301272, Example 6/10)
Affinity DataIC50:  1.60nM. Assay description: Inverse agonist activity at human GAL4 DBD-fused RORgammat LBD (237 to 497 residues) expressed in HEK293T cells assessed as reduction in ROR mediated...
Ligand InfoPC cidPC sid
In DepthDetails ArticlePubMed
TargetNuclear receptor ROR-gamma(Homo sapiens (Human))
Phenex Pharmaceuticals
Curated by ChEMBL
LigandPNGBDBM392012(US10301272, Example 6/10)
Affinity DataKd:  7.5nM. Assay description: Binding affinity to recombinant human RORgamma LBD (237 to 497 residues) expressed in Escherichia coli BL21 (DE3) GOLD by 1,8-ANS dye-based thermoflu...
Ligand InfoPC cidPC sid
In DepthDetails ArticlePubMed
TargetNuclear receptor ROR-beta(Homo sapiens (Human))
Phenex Pharmaceuticals
Curated by ChEMBL
LigandPNGBDBM392012(US10301272, Example 6/10)
Affinity DataKd:  9.20E+3nM. Assay description: Binding affinity to recombinant human RORbeta LBD (201 to 452 residues) expressed in Escherichia coli BL21 (DE3) GOLD by 1,8-ANS dye-based thermofluo...
Ligand InfoPC cidPC sid
In DepthDetails ArticlePubMed
TargetIsoform 2 of Nuclear receptor ROR-gamma (RORgT)(Homo sapiens (Human))
Phenex Pharmaceuticals
US Patent
LigandPNGBDBM392012(US10301272, Example 6/10)
Affinity DataIC50:  2nM. Assay description: Cells were incubated for additional 16 h before renilla (REN) luciferase activities were measured sequentially in the same cell extract using a Dual-...
Ligand InfoPC cidPC sid
In DepthDetails US Patent