BDBM394644 3-[(2-{[1-(pyrimidin-5-yl)cyclopropyl]amino}pyrimidin-5-yl)carbonyl]benzonitrile::US10308615, Example 1
SMILES O=C(c1cnc(NC2(CC2)c2cncnc2)nc1)c1cccc(c1)C#N
InChI Key InChIKey=OJUWWGHSEBTYGS-UHFFFAOYSA-N
Data  6 IC50
  Tab Delimited (TSV)   2D SDfile   Computed 3D by Vconf -m prep SDfile
Find this compound or compounds like it in BindingDB:
Activity Spreadsheet -- Enzyme Inhibition Constant Data from BindingDB
Found 6 hits for monomerid = 394644
TargetPantetheinase(Homo sapiens (Human))
Pfizer
US Patent
LigandPNGBDBM394644(3-[(2-{[1-(pyrimidin-5-yl)cyclopropyl]amino}pyrimi...)
Affinity DataIC50:  4.10nM. Assay description: The vanin-1 protein was prepared in-house from a construct expressing the extracellular domain of human vanin-1 (GenBank ID NM_004666) preceded N-ter...
Ligand InfoPC cidPC sid
In DepthDetails US Patent
TargetPantetheinase(Homo sapiens (Human))
Pfizer
US Patent
LigandPNGBDBM394644(3-[(2-{[1-(pyrimidin-5-yl)cyclopropyl]amino}pyrimi...)
Affinity DataIC50:  7nM. Assay description: The vanin-1 protein was prepared in-house from a construct expressing the extracellular domain of human vanin-1 (GenBank ID NM_004666) preceded N-ter...
Ligand InfoPC cidPC sid
In DepthDetails US Patent
TargetBiotinidase(Homo sapiens)
Pfizer
Curated by ChEMBL
LigandPNGBDBM394644(3-[(2-{[1-(pyrimidin-5-yl)cyclopropyl]amino}pyrimi...)
Affinity DataIC50:  2.40E+4nM. Assay description: Inhibition of N-terminal FLAG/His6-tagged human biotinidase expressed in COS cells using biotinyl-7-amino-4-trifluoromethylcoumarin as substrate prei...
Ligand InfoPC cidPC sid
In DepthDetails ArticlePubMed
TargetPantetheinase(Mus musculus)
Pfizer
Curated by ChEMBL
LigandPNGBDBM394644(3-[(2-{[1-(pyrimidin-5-yl)cyclopropyl]amino}pyrimi...)
Affinity DataIC50:  4.80nM. Assay description: Inhibition of mouse vanin-1
Ligand InfoPC cidPC sid
In DepthDetails ArticlePubMed
TargetPantetheinase(Homo sapiens (Human))
Pfizer
US Patent
LigandPNGBDBM394644(3-[(2-{[1-(pyrimidin-5-yl)cyclopropyl]amino}pyrimi...)
Affinity DataIC50:  12nM. Assay description: Inhibition of human plasma vanin-1 using pantetheine-7-amino-4-trifluoromethykournarin as substrate preincubated for 30 mins followed by substrate ad...
Ligand InfoPC cidPC sid
In DepthDetails ArticlePubMed
TargetPantetheinase(Homo sapiens (Human))
Pfizer
US Patent
LigandPNGBDBM394644(3-[(2-{[1-(pyrimidin-5-yl)cyclopropyl]amino}pyrimi...)
Affinity DataIC50:  4.10nM. Assay description: Inhibition of recombinant N-terminal FLAG/His6-tagged human vanin-1 expressed in CHO cells using Pantetheine-7-amino-4-trifluoromethykournarin as sub...
Ligand InfoPC cidPC sid
In DepthDetails ArticlePubMed