BDBM39500 4-(tetrahydrofuran-2-carbonylamino)benzoic acid propyl ester::4-[[oxo(2-oxolanyl)methyl]amino]benzoic acid propyl ester::MLS000088343::SMR000071702::cid_2931009::propyl 4-(oxolan-2-ylcarbonylamino)benzoate::propyl 4-(oxolane-2-carbonylamino)benzoate::propyl 4-[(tetrahydro-2-furanylcarbonyl)amino]benzoate
SMILES CCCOC(=O)c1ccc(NC(=O)C2CCCO2)cc1
InChI Key InChIKey=ZOIJGMFYKLHEBY-UHFFFAOYSA-N
Data  2 EC50
  Tab Delimited (TSV)   2D SDfile   Computed 3D by Vconf -m prep SDfile
Find this compound or compounds like it in BindingDB:
Activity Spreadsheet -- Enzyme Inhibition Constant Data from BindingDB
Found 2 hits for monomerid = 39500
TargetIsoform 2 of Nuclear receptor ROR-alpha (Alpha-2)(Homo sapiens (Human))
The Scripps Research Institute Molecular Screening Center
Curated by PubChem BioAssay
LigandPNGBDBM39500(4-(tetrahydrofuran-2-carbonylamino)benzoic acid pr...)
Affinity DataEC50: >3.67E+3nM. Assay description: Source (MLSCN Center Name): The Scripps Research Institute Molecular Screening Center Center Affiliation: The Scripps Research Institute, TSRI Assay ...
In DepthDetails PCBioAssay
TargetSteroidogenic factor 1(Homo sapiens (Human))
The Scripps Research Institute Molecular Screening Center
Curated by PubChem BioAssay
LigandPNGBDBM39500(4-(tetrahydrofuran-2-carbonylamino)benzoic acid pr...)
Affinity DataEC50:  2.49E+3nM. Assay description: Source (MLSCN Center Name): The Scripps Research Institute Molecular Screening Center Center Affiliation: The Scripps Research Institute, TSRI Assay ...
In DepthDetails PCBioAssay