BDBM396682 6-(6'-(difluoromethyl)-[2,2'-bipyridin]-3- yl)imidazo[1,2-a]pyridine-3-carbonitrile::US9981944, Example 28
SMILES FC(F)c1cccc(n1)-c1ncccc1-c1ccc2ncc(C#N)n2c1
InChI Key InChIKey=RMQUGDMQZURTHV-UHFFFAOYSA-N
Data  2 IC50
  Tab Delimited (TSV)   2D SDfile   Computed 3D by Vconf -m prep SDfile
Find this compound or compounds like it in BindingDB:
Activity Spreadsheet -- Enzyme Inhibition Constant Data from BindingDB
Found 2 hits for monomerid = 396682
TargetTGF-beta receptor type-2(Homo sapiens (Human))
Rigel Pharmaceuticals
US Patent
LigandPNGBDBM396682(6-(6'-(difluoromethyl)-[2,2'-bipyridin]-3- yl)imid...)
Affinity DataIC50: >1.50E+4nM. Assay description: Assays for the compounds reported below were conducted in 1536-well plates and 2 mL reactions are prepared from addition of HIS-TGFβR1 T204D or ...
Ligand InfoPC cidPC sid
In DepthDetails US Patent
TargetTGF-beta receptor type-1 [T204D](Homo sapiens (Human))
Rigel Pharmaceuticals
US Patent
LigandPNGBDBM396682(6-(6'-(difluoromethyl)-[2,2'-bipyridin]-3- yl)imid...)
Affinity DataIC50:  9nM. Assay description: Assays for the compounds reported below were conducted in 1536-well plates and 2 mL reactions are prepared from addition of HIS-TGFβR1 T204D or ...
Ligand InfoPC cidPC sid
In DepthDetails US Patent