BDBM396738 6-(6'-(difluoromethyl)-5-fluoro-[2,2'-bipyridin]- 3-yl)imidazo[1,2-a]pyridine-3-carboxamide::US9981944, Example 84
SMILES NC(=O)c1cnc2ccc(cn12)-c1cc(F)cnc1-c1cccc(n1)C(F)F
InChI Key InChIKey=YKRXQSOZJKVUAG-UHFFFAOYSA-N
Data  2 IC50
  Tab Delimited (TSV)   2D SDfile   Computed 3D by Vconf -m prep SDfile
Find this compound or compounds like it in BindingDB:
Activity Spreadsheet -- Enzyme Inhibition Constant Data from BindingDB
Found 2 hits for monomerid = 396738
TargetTGF-beta receptor type-2(Homo sapiens (Human))
Rigel Pharmaceuticals
US Patent
LigandPNGBDBM396738(6-(6'-(difluoromethyl)-5-fluoro-[2,2'-bipyridin]- ...)
Affinity DataIC50: >1.50E+4nM. Assay description: Assays for the compounds reported below were conducted in 1536-well plates and 2 mL reactions are prepared from addition of HIS-TGFβR1 T204D or ...
Ligand InfoPC cidPC sid
In DepthDetails US Patent
TargetTGF-beta receptor type-1 [T204D](Homo sapiens (Human))
Rigel Pharmaceuticals
US Patent
LigandPNGBDBM396738(6-(6'-(difluoromethyl)-5-fluoro-[2,2'-bipyridin]- ...)
Affinity DataIC50:  1nM. Assay description: Assays for the compounds reported below were conducted in 1536-well plates and 2 mL reactions are prepared from addition of HIS-TGFβR1 T204D or ...
Ligand InfoPC cidPC sid
In DepthDetails US Patent