BDBM396740 6-(5,5'-difluoro-6'-methyl-[2,2'-bipyridin]-3- yl)imidazo[1,2-a]pyridine-3-carboxamide::US9981944, Example 85
SMILES Cc1nc(ccc1F)-c1ncc(F)cc1-c1ccc2ncc(C(N)=O)n2c1
InChI Key InChIKey=YNEYPWVDECTXGL-UHFFFAOYSA-N
Data  2 IC50
  Tab Delimited (TSV)   2D SDfile   Computed 3D by Vconf -m prep SDfile
Find this compound or compounds like it in BindingDB:
Activity Spreadsheet -- Enzyme Inhibition Constant Data from BindingDB
Found 2 hits for monomerid = 396740
TargetTGF-beta receptor type-2(Homo sapiens (Human))
Rigel Pharmaceuticals
US Patent
LigandPNGBDBM396740(6-(5,5'-difluoro-6'-methyl-[2,2'-bipyridin]-3- yl)...)
Affinity DataIC50:  1.43E+4nM. Assay description: Assays for the compounds reported below were conducted in 1536-well plates and 2 mL reactions are prepared from addition of HIS-TGFβR1 T204D or ...
Ligand InfoPC cidPC sid
In DepthDetails US Patent
TargetTGF-beta receptor type-1 [T204D](Homo sapiens (Human))
Rigel Pharmaceuticals
US Patent
LigandPNGBDBM396740(6-(5,5'-difluoro-6'-methyl-[2,2'-bipyridin]-3- yl)...)
Affinity DataIC50:  2nM. Assay description: Assays for the compounds reported below were conducted in 1536-well plates and 2 mL reactions are prepared from addition of HIS-TGFβR1 T204D or ...
Ligand InfoPC cidPC sid
In DepthDetails US Patent