BDBM396760 6-(6'-(difluoromethyl)-[2,2'-bipyridin]-3- yl)pyrido[3,2-d]pyrimidin-4-amine::US9981944, Example 105
SMILES Nc1ncnc2ccc(nc12)-c1cccnc1-c1cccc(n1)C(F)F
InChI Key InChIKey=DBWHTIBDVVUYEM-UHFFFAOYSA-N
Data  2 IC50
  Tab Delimited (TSV)   2D SDfile   Computed 3D by Vconf -m prep SDfile
Find this compound or compounds like it in BindingDB:
Activity Spreadsheet -- Enzyme Inhibition Constant Data from BindingDB
Found 2 hits for monomerid = 396760
TargetTGF-beta receptor type-2(Homo sapiens (Human))
Rigel Pharmaceuticals
US Patent
LigandPNGBDBM396760(6-(6'-(difluoromethyl)-[2,2'-bipyridin]-3- yl)pyri...)
Affinity DataIC50: >1.50E+4nM. Assay description: Assays for the compounds reported below were conducted in 1536-well plates and 2 mL reactions are prepared from addition of HIS-TGFβR1 T204D or ...
Ligand InfoPC cidPC sid
In DepthDetails US Patent
TargetTGF-beta receptor type-1 [T204D](Homo sapiens (Human))
Rigel Pharmaceuticals
US Patent
LigandPNGBDBM396760(6-(6'-(difluoromethyl)-[2,2'-bipyridin]-3- yl)pyri...)
Affinity DataIC50:  3nM. Assay description: Assays for the compounds reported below were conducted in 1536-well plates and 2 mL reactions are prepared from addition of HIS-TGFβR1 T204D or ...
Ligand InfoPC cidPC sid
In DepthDetails US Patent