BDBM405516 USRE47493, Example 70.14
SMILES FC(F)(F)c1cccc(c1)N1C(=O)N(C(C2=C1CCCC2=O)c1ccc(cc1)C#N)C(=O)NC1CCOCC1
InChI Key InChIKey=NQFRYKFWZRGUQD-UHFFFAOYSA-N
Data  1 IC50
  Tab Delimited (TSV)   2D SDfile   Computed 3D by Vconf -m prep SDfile
Find this compound or compounds like it in BindingDB:
Activity Spreadsheet -- Enzyme Inhibition Constant Data from BindingDB
Found 1 hit for monomerid = 405516
TargetNeutrophil elastase(Homo sapiens (Human))
Boehringer Ingelheim International
US Patent
LigandPNGBDBM405516(USRE47493, Example 70.14)
Affinity DataIC50: <1nM. Assay description: Materials: Human neutrophil elastase was purchased from Calbiochem (Cat.No.: 324681) and the elastase substrate MeOSuc-Ala-Ala-Pro-Val-AMC from Bache...
Ligand InfoPC cidPC sid
In DepthDetails US Patent