BDBM409762 N-Ethyl-N-methyl-2-[3-methyl-6-(5-methyl-2-thienyl)pyrrolo[3,2-::US10377753, Example 630
SMILES CCN(C)C(=O)Cn1cc(C)c2ncc(cc12)-c1ccc(C)s1
InChI Key InChIKey=KTMSIHXWHMIJDV-UHFFFAOYSA-N
Data  1 IC50
  Tab Delimited (TSV)   2D SDfile   Computed 3D by Vconf -m prep SDfile
Find this compound or compounds like it in BindingDB:
Activity Spreadsheet -- Enzyme Inhibition Constant Data from BindingDB
Found 1 hit for monomerid = 409762
TargetGlutamate receptor ionotropic, NMDA 2B(Homo sapiens (Human))
Janssen Pharmaceutica
US Patent
LigandPNGBDBM409762(N-Ethyl-N-methyl-2-[3-methyl-6-(5-methyl-2-thienyl...)
Affinity DataIC50:  251nM. Assay description: The assay depends on the binding of a tracer to the GluN2B subunit-containing NMDA receptors and the ability of the test compounds to displace such b...
Ligand InfoPC cidPC sid
In DepthDetails US Patent