BDBM413439 2-(dimethylamino)ethyl 2-(3-{[2-amino-4-(pentylamino)-5H-pyrrolo[3,2-d]pyrimidin-5-yl]methyl}-4-methoxyphenoxy)acetate::US10407431, Example 26
SMILES CCCCCNc1nc(N)nc2ccn(Cc3cc(OCC(=O)OCCN(C)C)ccc3OC)c12
InChI Key InChIKey=JLVGGBGDDHERCL-UHFFFAOYSA-N
Data  1 EC50
  Tab Delimited (TSV)   2D SDfile   Computed 3D by Vconf -m prep SDfile
Find this compound or compounds like it in BindingDB:
Activity Spreadsheet -- Enzyme Inhibition Constant Data from BindingDB
Found 1 hit for monomerid = 413439
TargetToll-like receptor 7(Homo sapiens (Human))
Novartis
US Patent
LigandPNGBDBM413439(2-(dimethylamino)ethyl 2-(3-{[2-amino-4-(pentylami...)
Affinity DataEC50:  300nM. Assay description: Human embryonic kidney 293 (HEK 293) cells were stably transfected with human TLR7 and an NF-kB-driven luciferase reporter vector (pNifty-Luciferase)...
Ligand Info
In DepthDetails US Patent