BDBM416553 US10307425, Example 19::US10632122, Example 19
SMILES CC(C)(CO)Cn1nc(-c2ccc3nc(OC4CC4)ccc3c2)c2c(N)ncnc12
InChI Key InChIKey=PUXIOPSZYWXPAU-UHFFFAOYSA-N
Data  5 IC50
  Tab Delimited (TSV)   2D SDfile   Computed 3D by Vconf -m prep SDfile
Find this compound or compounds like it in BindingDB:
Activity Spreadsheet -- Enzyme Inhibition Constant Data from BindingDB
Found 5 hits for monomerid = 416553
TargetCAM kinase, CDPK family TgCDPK1(Toxoplasma gondii (strain ATCC 50861 / VEG))
University Of Washington
US Patent
LigandPNGBDBM416553(US10307425, Example 19 | US10632122, Example 19)
Affinity DataIC50:  1.30nM. Assay description: Inhibitors were evaluated in triplicate in eight-point dilutions (3-fold dilutions) during the enzymatic reactions. TgCDPK1 enzymatic inhibition was ...
Ligand InfoPC cidPC sid
In DepthDetails US Patent
TargetCalmodulin-domain protein kinase 1(Toxoplasma gondii)
University Of Washington
US Patent
LigandPNGBDBM416553(US10307425, Example 19 | US10632122, Example 19)
Affinity DataIC50:  1.30nM. Assay description: Inhibitors were evaluated in triplicate in eight-point dilutions (3-fold dilutions) during the enzymatic reactions. TgCDPK1 enzymatic inhibition was ...
Ligand InfoPC cidPC sid
In DepthDetails US Patent
TargetCalmodulin-domain protein kinase 1(Toxoplasma gondii)
University Of Washington
US Patent
LigandPNGBDBM416553(US10307425, Example 19 | US10632122, Example 19)
Affinity DataIC50:  1.30nM. Assay description: Inhibition of recombinant Toxoplasma gondii CDPK1 using Biotin-C6-PLARTLSVAGLPGKK as substrate after 90 mins in presence of ATP by luciferase reporte...
Ligand InfoPC cidPC sid
In DepthDetails ArticlePubMed
TargetPotassium voltage-gated channel subfamily H member 2(Homo sapiens (Human))
University Of Washington
Curated by ChEMBL
LigandPNGBDBM416553(US10307425, Example 19 | US10632122, Example 19)
Affinity DataIC50: >1.00E+4nM. Assay description: Inhibition of human ERG
Ligand InfoPC cidPC sid
In DepthDetails ArticlePubMed
TargetProto-oncogene tyrosine-protein kinase Src(Gallus gallus (Chicken))
University Of Washington
Curated by ChEMBL
LigandPNGBDBM416553(US10307425, Example 19 | US10632122, Example 19)
Affinity DataIC50:  7.40E+3nM. Assay description: Inhibition of chicken Src using AcEIYGEFKKK as substrate after 90 mins in presence of ATP by luciferase reporter gene assay
Ligand InfoPC cidPC sid
In DepthDetails ArticlePubMed