BDBM419236 N-(4-ethylphenyl)-N- isobutyl-3-(S- methylsulfonimidoyl)-4-(2- oxa-7-azaspiro[3.5]nonan- 7-yl)benzenesulfonamide::US10457637, Compound 114
SMILES CCc1ccc(cc1)N(CC(C)C)S(=O)(=O)c1ccc(N2CCC3(COC3)CC2)c(c1)S(C)(=N)=O
InChI Key InChIKey=HTLJGDDOXOYDIA-UHFFFAOYSA-N
Data  2 IC50
  Tab Delimited (TSV)   2D SDfile   Computed 3D by Vconf -m prep SDfile
Find this compound or compounds like it in BindingDB:
Activity Spreadsheet -- Enzyme Inhibition Constant Data from BindingDB
Found 2 hits for monomerid = 419236
TargetInterleukin-17A(Homo sapiens (Human))
Galderma Research & Development
US Patent
LigandPNGBDBM419236(N-(4-ethylphenyl)-N- isobutyl-3-(S- methylsulfonim...)
Affinity DataIC50:  550nM. Assay description: This model allows measurement of the effect of inhibitors on IL-17A secretion by CD4+ cells. The cells are frozen CD4+ cells (STEMCELL, #70026), isol...
Ligand InfoPC cidPC sid
In DepthDetails US Patent
TargetNuclear receptor ROR-gamma(Homo sapiens (Human))
Galderma Research & Development
US Patent
LigandPNGBDBM419236(N-(4-ethylphenyl)-N- isobutyl-3-(S- methylsulfonim...)
Affinity DataIC50:  550nM. Assay description: The RORγ transactivation model was developed from the line HG5LN, which is a HeLa line that stably expresses a luciferase reporter gene controll...
Ligand InfoPC cidPC sid
In DepthDetails US Patent