BDBM423091 (methyl(4-((2-(5-chloro-2,4- dimethoxyphenyl)imidazo[1,2- a]pyridin-7-yl)-trans- amino)cyclohexyl)carbamate::US10508109, Example 277
SMILES COc1cc(CO)c(cc1Cl)-c1cn2ccc(N[C@H]3CC[C@@H](CC3)NC(=O)CO)cc2n1
InChI Key InChIKey=IVHZDNBMGXJSED-WKILWMFISA-N
Data  1 IC50
  Tab Delimited (TSV)   2D SDfile   Computed 3D by Vconf -m prep SDfile
Find this compound or compounds like it in BindingDB:
Activity Spreadsheet -- Enzyme Inhibition Constant Data from BindingDB
Found 1 hit for monomerid = 423091
TargetHistone-lysine N-methyltransferase SUV39H2(Homo sapiens (Human))
Oncotherapy Science
US Patent
LigandPNGBDBM423091((methyl(4-((2-(5-chloro-2,4- dimethoxyphenyl)imida...)
Affinity DataIC50:  5.24nM. Assay description: Assay buffer (4 μL) was added into all the wells, including test compound and control wells (except for Sinefungin control wells), using the Mul...
Ligand InfoPC cidPC sid
In DepthDetails US Patent