BDBM423281 US10501451, Example 9, P-1::US10501451, Example 9, P-2::US10954225, Example 9,P-2
SMILES Cc1ccc(CN2OCC(N3CCC(CC3)c3ccc(O)cn3)C2=O)cc1
InChI Key InChIKey=BBNCALBVVXJSMD-UHFFFAOYSA-N
Data  4 KI
  Tab Delimited (TSV)   2D SDfile   Computed 3D by Vconf -m prep SDfile
Find this compound or compounds like it in BindingDB:
Activity Spreadsheet -- Enzyme Inhibition Constant Data from BindingDB
Found 4 hits for monomerid = 423281
TargetGlutamate receptor ionotropic, NMDA 2B(Rattus norvegicus (Rat))
Bristol-Myers Squibb
US Patent
LigandPNGBDBM423281(US10501451, Example 9, P-1 | US10501451, Example 9...)
Affinity DataKi:  12.1nM. Assay description: Binding experiments to determine binding to NR2B-subtype NMDA receptors were performed on forebrains of 8-10 weeks old male Sprague Dawley rats (Harl...
Ligand InfoPC cidPC sid
In DepthDetails US Patent
TargetGlutamate receptor ionotropic, NMDA 2B(Rattus norvegicus (Rat))
Bristol-Myers Squibb
US Patent
LigandPNGBDBM423281(US10501451, Example 9, P-1 | US10501451, Example 9...)
Affinity DataKi:  12.1nM. Assay description: To perform the competition binding assay, thawed membrane homogenate was added to each well of a 96-well plate (20 μg/well). The experimental co...
Ligand InfoPC cidPC sid
In DepthDetails US Patent
TargetGlutamate receptor ionotropic, NMDA 2B(Rattus norvegicus (Rat))
Bristol-Myers Squibb
US Patent
LigandPNGBDBM423281(US10501451, Example 9, P-1 | US10501451, Example 9...)
Affinity DataKi:  139nM. Assay description: To perform the competition binding assay, thawed membrane homogenate was added to each well of a 96-well plate (20 μg/well). The experimental co...
Ligand InfoPC cidPC sid
In DepthDetails US Patent
TargetGlutamate receptor ionotropic, NMDA 2B(Rattus norvegicus (Rat))
Bristol-Myers Squibb
US Patent
LigandPNGBDBM423281(US10501451, Example 9, P-1 | US10501451, Example 9...)
Affinity DataKi:  139nM. Assay description: Binding experiments to determine binding to NR2B-subtype NMDA receptors were performed on forebrains of 8-10 weeks old male Sprague Dawley rats (Harl...
Ligand InfoPC cidPC sid
In DepthDetails US Patent