BDBM42442 (5-chloro-2-isopropoxy-3-methoxy-benzyl)-methyl-amine;hydrochloride::(5-chloro-2-isopropoxy-3-methoxybenzyl)methylamine hydrochloride::1-(5-chloranyl-3-methoxy-2-propan-2-yloxy-phenyl)-N-methyl-methanamine;hydrochloride::1-(5-chloro-3-methoxy-2-propan-2-yloxyphenyl)-N-methylmethanamine;hydrochloride::MLS000664919::SMR000294892::cid_2960537
SMILES CNCc1cc(Cl)cc(OC)c1OC(C)C
InChI Key InChIKey=LUMXGICJTFNECJ-UHFFFAOYSA-N
Data  2 IC50
  Tab Delimited (TSV)   2D SDfile   Computed 3D by Vconf -m prep SDfile
Find this compound or compounds like it in BindingDB:
Activity Spreadsheet -- Enzyme Inhibition Constant Data from BindingDB
Found 2 hits for monomerid = 42442
TargetNeuropeptide Y receptor type 2(Homo sapiens (Human))
The Scripps Research Institute Molecular Screening Center
Curated by PubChem BioAssay
LigandPNGBDBM42442((5-chloro-2-isopropoxy-3-methoxy-benzyl)-methyl-am...)
Affinity DataIC50: >3.50E+4nM. Assay description: Source (MLSCN Center Name): The Scripps Research Institute Molecular Screening Center Affiliation: The Scripps Research Institute, TSRI Assay Provide...
In DepthDetails PCBioAssay
TargetNeuropeptide Y receptor type 1(Homo sapiens (Human))
The Scripps Research Institute Molecular Screening Center
Curated by PubChem BioAssay
LigandPNGBDBM42442((5-chloro-2-isopropoxy-3-methoxy-benzyl)-methyl-am...)
Affinity DataIC50: >3.50E+4nM. Assay description: Source (MLSCN Center Name): The Scripps Research Institute Molecular Screening Center Affiliation: The Scripps Research Institute, TSRI Assay Provide...
In DepthDetails PCBioAssay