BDBM42572 MLS000705653::N-[4-(hexylsulfamoyl)phenyl]-2-oxolanecarboxamide::N-[4-(hexylsulfamoyl)phenyl]oxolane-2-carboxamide::N-[4-(hexylsulfamoyl)phenyl]tetrahydrofuran-2-carboxamide::N-{4-[(hexylamino)sulfonyl]phenyl}tetrahydro-2-furancarboxamide::SMR000231050::cid_5132730
SMILES CCCCCCNS(=O)(=O)c1ccc(NC(=O)C2CCCO2)cc1
InChI Key InChIKey=APXMICVTOJLGHL-UHFFFAOYSA-N
Data  1 IC50
  Tab Delimited (TSV)   2D SDfile   Computed 3D by Vconf -m prep SDfile
Find this compound or compounds like it in BindingDB:
Activity Spreadsheet -- Enzyme Inhibition Constant Data from BindingDB
Found 1 hit for monomerid = 42572
TargetNeuropeptide Y receptor type 1(Homo sapiens (Human))
The Scripps Research Institute Molecular Screening Center
Curated by PubChem BioAssay
LigandPNGBDBM42572(MLS000705653 | N-[4-(hexylsulfamoyl)phenyl]-2-oxol...)
Affinity DataIC50:  1.37E+4nM. Assay description: Source (MLSCN Center Name): The Scripps Research Institute Molecular Screening Center Affiliation: The Scripps Research Institute, TSRI Assay Provide...
In DepthDetails PCBioAssay