BDBM425750 US10519177, Compound P-0950::methyl 4-[5-(3,5-dimethylisoxazol- 4-yl)-3-diphenylphosphoryl- pyrrolo[2,3-b]pyridin-1-yl]benzoate
SMILES COC(=O)c1ccc(cc1)-n1cc(c2cc(cnc12)-c1c(C)noc1C)P(=O)(c1ccccc1)c1ccccc1
InChI Key InChIKey=JGFZUQQTPPKBRJ-UHFFFAOYSA-N
Data  1 IC50
  Tab Delimited (TSV)   2D SDfile   Computed 3D by Vconf -m prep SDfile
Find this compound or compounds like it in BindingDB:
Activity Spreadsheet -- Enzyme Inhibition Constant Data from BindingDB
Found 1 hit for monomerid = 425750
TargetBromodomain-containing protein 4 [1-477](Homo sapiens (Human))
Plexxikon
US Patent
LigandPNGBDBM425750(US10519177, Compound P-0950 | methyl 4-[5-(3,5-dim...)
Affinity DataIC50: <1.00E+3nM
Ligand InfoPC cidPC sid
In DepthDetails US Patent